Reaction Details
TargetLarge T antigen
LigandBDBM60343
Substrate/Competitorn/a
Meas. Tech.Identification of SV40 T antigen inhibitors: A route to novel anti-viral reagents
IC50 6240±n/a nM
Citation PubChem, PC Identification of SV40 T antigen inhibitors: A route to novel anti-viral reagents PubChem Bioassay(2010)[AID]
 
Large T antigen
Name:Large T antigen
Type:Enzyme Catalytic Domain
Mol. Mass.:81575.54
Organism:Simian virus 40
Description:P03070
Residue:708
BDBM60343
NameBDBM60343
Synonyms:MLS000035128 N-[9-[2-[4-(dimethylamino)anilino]-2-oxoethyl]-9-azabicyclo[3.3.1]nonan-3-yl]-3-methoxybenzamide N-{9-[(4-Dimethylamino-phenylcarbamoyl)-methyl]-9-aza-bicyclo[3.3.1]non-3-yl}-3-methoxy-benzamide cid_645059
TypeSmall organic molecule
Emp. Form.C26H34N4O3
Mol. Mass.450.5732
SMILES[H]C12CCCC([H])(CC(C1)NC(=O)c1cccc(OC)c1)N2CC(=O)Nc1ccc(cc1)N(C)C