Reaction Details
TargetLarge T antigen
LigandBDBM60349
Substrate/Competitorn/a
Meas. Tech.Identification of SV40 T antigen inhibitors: A route to novel anti-viral reagents
IC50 5610±n/a nM
Citation PubChem, PC Identification of SV40 T antigen inhibitors: A route to novel anti-viral reagents PubChem Bioassay(2010)[AID]
 
Large T antigen
Name:Large T antigen
Type:Enzyme Catalytic Domain
Mol. Mass.:81575.54
Organism:Simian virus 40
Description:P03070
Residue:708
BDBM60349
NameBDBM60349
Synonyms:4-[4-[(1-cyclopentyl-1,2,3,4-tetrazol-5-yl)-pyridin-4-yl-methyl]piperazin-1-yl]phenol 4-[4-[(1-cyclopentyltetrazol-5-yl)-(4-pyridyl)methyl]piperazino]phenol 4-{4-[(1-Cyclopentyl-1H-tetrazol-5-yl)-pyridin-4-yl-methyl]-piperazin-1-yl}-phenol SMR000008237 | cid_654063
TypeSmall organic molecule
Emp. Form.C22H27N7O
Mol. Mass.405.4961
SMILESOc1ccc(cc1)N1CCN(CC1)C(c1nnnn1C1CCCC1)c1ccncc1