Reaction Details
TargetLarge T antigen
LigandBDBM4375
Substrate/Competitorn/a
Meas. Tech.Identification of SV40 T antigen inhibitors: A route to novel anti-viral reagents
IC50 7300±n/a nM
Citation PubChem, PC Identification of SV40 T antigen inhibitors: A route to novel anti-viral reagents PubChem Bioassay(2010)[AID]
 
Large T antigen
Name:Large T antigen
Type:Enzyme Catalytic Domain
Mol. Mass.:81575.54
Organism:Simian virus 40
Description:P03070
Residue:708
BDBM4375
NameBDBM4375
Synonyms:(2E)-3-(3,4-dihydroxyphenyl)prop-2-enoic acid 3,4-Dihydroxycinnamate, XVII Caffeic acid cid_689043
TypeSmall organic molecule
Emp. Form.C9H8O4
Mol. Mass.180.1574
SMILESOC(=O)\C=C\c1ccc(O)c(O)c1