Reaction Details
TargetLarge T antigen
LigandBDBM60355
Substrate/Competitorn/a
Meas. Tech.Identification of SV40 T antigen inhibitors: A route to novel anti-viral reagents
IC50 6200±n/a nM
Citation PubChem, PC Identification of SV40 T antigen inhibitors: A route to novel anti-viral reagents PubChem Bioassay(2010)[AID]
 
Large T antigen
Name:Large T antigen
Type:Enzyme Catalytic Domain
Mol. Mass.:81575.54
Organism:Simian virus 40
Description:P03070
Residue:708
BDBM60355
NameBDBM60355
Synonyms:2-ACETAMIDOPHENOL MLS000069599 N-(2-hydroxyphenyl)ethanamide cid_11972
TypeSmall organic molecule
Emp. Form.C8H9NO2
Mol. Mass.151.1626
SMILESCC(=O)Nc1ccccc1O