Reaction Details
TargetLarge T antigen
LigandBDBM60358
Substrate/Competitorn/a
Meas. Tech.Identification of SV40 T antigen inhibitors: A route to novel anti-viral reagents
IC50 9270±n/a nM
Citation PubChem, PC Identification of SV40 T antigen inhibitors: A route to novel anti-viral reagents PubChem Bioassay(2010)[AID]
 
Large T antigen
Name:Large T antigen
Type:Enzyme Catalytic Domain
Mol. Mass.:81575.54
Organism:Simian virus 40
Description:P03070
Residue:708
BDBM60358
NameBDBM60358
Synonyms:4-N,4-N-dimethyl-1-N-(5-methyl-4,5-dihydro-1,3-thiazol-2-yl)benzene-1,4-diamine N4,N4-dimethyl-N1-(5-methyl-4,5-dihydro-1,3-thiazol-2-yl)benzene-1,4-diamine SMR000057785 dimethyl-[4-[(5-methyl-2-thiazolin-2-yl)amino]phenyl]amine
TypeSmall organic molecule
Emp. Form.C12H17N3S
Mol. Mass.235.348
SMILESCC1CN=C(Nc2ccc(cc2)N(C)C)S1