Reaction Details
TargetLarge T antigen
LigandBDBM32041
Substrate/Competitorn/a
Meas. Tech.Identification of SV40 T antigen inhibitors: A route to novel anti-viral reagents
IC50 10460±n/a nM
Citation PubChem, PC Identification of SV40 T antigen inhibitors: A route to novel anti-viral reagents PubChem Bioassay(2010)[AID]
 
Large T antigen
Name:Large T antigen
Type:Enzyme Catalytic Domain
Mol. Mass.:81575.54
Organism:Simian virus 40
Description:P03070
Residue:708
BDBM32041
NameBDBM32041
Synonyms:3-[[(Z)-(3-hydroxy-4-keto-cyclohexa-2,5-dien-1-ylidene)methyl]amino]-2-propyl-quinazolin-4-one 3-[[(Z)-(3-hydroxy-4-oxocyclohexa-2,5-dien-1-ylidene)methyl]amino]-2-propylquinazolin-4-one MLS000039021 cid_5389225
TypeSmall organic molecule
Emp. Form.C18H17N3O3
Mol. Mass.323.3459
SMILESCCCc1nc2ccccc2c(=O)n1N=Cc1ccc(O)c(O)c1