Reaction Details
TargetLarge T antigen
LigandBDBM51541
Substrate/Competitorn/a
Meas. Tech.Identification of SV40 T antigen inhibitors: A route to novel anti-viral reagents
IC50 7640±n/a nM
Citation PubChem, PC Identification of SV40 T antigen inhibitors: A route to novel anti-viral reagents PubChem Bioassay(2010)[AID]
 
Large T antigen
Name:Large T antigen
Type:Enzyme Catalytic Domain
Mol. Mass.:81575.54
Organism:Simian virus 40
Description:P03070
Residue:708
BDBM51541
NameBDBM51541
Synonyms:2-(4-Amino-phenyl)-4-chloro-3H-benzoimidazol-5-ylamine 2-(4-aminophenyl)-4-chloro-1H-benzimidazol-5-amine SMR000019041 cid_762544
TypeSmall organic molecule
Emp. Form.C13H11ClN4
Mol. Mass.258.706
SMILESNc1ccc(cc1)-c1nc2ccc(N)c(Cl)c2[nH]1