Reaction Details
TargetLarge T antigen
LigandBDBM60397
Substrate/Competitorn/a
Meas. Tech.Identification of SV40 T antigen inhibitors: A route to novel anti-viral reagents
IC50 7360±n/a nM
Citation PubChem, PC Identification of SV40 T antigen inhibitors: A route to novel anti-viral reagents PubChem Bioassay(2010)[AID]
 
Large T antigen
Name:Large T antigen
Type:Enzyme Catalytic Domain
Mol. Mass.:81575.54
Organism:Simian virus 40
Description:P03070
Residue:708
BDBM60397
NameBDBM60397
Synonyms:MLS000115777 N-(4-hydroxyphenyl)quinoline-8-sulfonamide cid_894115
TypeSmall organic molecule
Emp. Form.C15H12N2O3S
Mol. Mass.300.332
SMILESOc1ccc(NS(=O)(=O)c2cccc3cccnc23)cc1