Reaction Details
TargetLarge T antigen
LigandBDBM60399
Substrate/Competitorn/a
Meas. Tech.Identification of SV40 T antigen inhibitors: A route to novel anti-viral reagents
IC50 4140±n/a nM
Citation PubChem, PC Identification of SV40 T antigen inhibitors: A route to novel anti-viral reagents PubChem Bioassay(2010)[AID]
 
Large T antigen
Name:Large T antigen
Type:Enzyme Catalytic Domain
Mol. Mass.:81575.54
Organism:Simian virus 40
Description:P03070
Residue:708
BDBM60399
NameBDBM60399
Synonyms:4-[3-(2,3-dihydro-1,4-benzodioxin-6-ylimino)-1,7-dihydroimidazo[1,2-a]pyrazin-2-ylidene]-1-cyclohexa-2,5-dienone MLS000116162 cid_6324571
TypeSmall organic molecule
Emp. Form.C20H16N4O3
Mol. Mass.360.366
SMILESOc1ccc(cc1)-c1nc2c[nH]ccn2c1=Nc1ccc2OCCOc2c1