Reaction Details
TargetG-protein coupled receptor 55
LigandBDBM60998
Substrate/Competitorn/a
Meas. Tech.Image-based HTS for Selective Agonists of GPR55
EC50 6330.077±n/a nM
Citation PubChem, PC Image-based HTS for Selective Agonists of GPR55 PubChem Bioassay(2010)[AID]
 
G-protein coupled receptor 55
Name:G-protein coupled receptor 55
Type:PROTEIN
Mol. Mass.:36649.72
Organism:Homo sapiens (Human)
Description:ChEMBL_1292265
Residue:319
BDBM60998
NameBDBM60998
Synonyms:1-[(1-Cyclopentyl-1H-tetrazol-5-yl)-thiophen-2-yl-methyl]-4-(2-methoxy-phenyl)-piperazine 1-[(1-cyclopentyl-5-tetrazolyl)-thiophen-2-ylmethyl]-4-(2-methoxyphenyl)piperazine 1-[(1-cyclopentyltetrazol-5-yl)-thiophen-2-ylmethyl]-4-(2-methoxyphenyl)piperazine SMR000003986 | cid_655956
TypeSmall organic molecule
Emp. Form.C22H28N6OS
Mol. Mass.424.562
SMILESCOc1ccccc1N1CCN(CC1)C(c1cccs1)c1nnnn1C1CCCC1