Reaction Details
TargetG-protein coupled receptor 55
LigandBDBM61007
Substrate/Competitorn/a
Meas. Tech.Image-based HTS for Selective Agonists of GPR55
EC50 5777.753±n/a nM
Citation PubChem, PC Image-based HTS for Selective Agonists of GPR55 PubChem Bioassay(2010)[AID]
 
G-protein coupled receptor 55
Name:G-protein coupled receptor 55
Type:PROTEIN
Mol. Mass.:36649.72
Organism:Homo sapiens (Human)
Description:ChEMBL_1292265
Residue:319
BDBM61007
NameBDBM61007
Synonyms:2-[[4-benzyl-5-(2,3-dimethyl-1H-indol-5-yl)-1,2,4-triazol-3-yl]sulfanyl]-N-(furan-2-ylmethyl)acetamide 2-[[5-(2,3-dimethyl-1H-indol-5-yl)-4-(phenylmethyl)-1,2,4-triazol-3-yl]sulfanyl]-N-(furan-2-ylmethyl)ethanamide 2-{[4-benzyl-5-(2,3-dimethyl-1H-indol-5-yl)-4H-1,2,4-triazol-3-yl]thio}-N-(2-furylmethyl)acetamide SMR000032892 | cid_3238533
TypeSmall organic molecule
Emp. Form.C26H25N5O2S
Mol. Mass.471.574
SMILESCc1[nH]c2ccc(cc2c1C)-c1nnc(SCC(=O)NCc2ccco2)n1Cc1ccccc1