Reaction Details
TargetG-protein coupled receptor 55
LigandBDBM33070
Substrate/Competitorn/a
Meas. Tech.Image-based HTS for Selective Agonists of GPR55
EC50 8010.452±n/a nM
Citation PubChem, PC Image-based HTS for Selective Agonists of GPR55 PubChem Bioassay(2010)[AID]
 
G-protein coupled receptor 55
Name:G-protein coupled receptor 55
Type:PROTEIN
Mol. Mass.:36649.72
Organism:Homo sapiens (Human)
Description:ChEMBL_1292265
Residue:319
BDBM33070
NameBDBM33070
Synonyms:4-(2,3-dihydro-1H-perimidin-2-yl)-2-ethoxy-phenol MLS000068595 cid_760604
TypeSmall organic molecule
Emp. Form.C19H18N2O2
Mol. Mass.306.3584
SMILESCCOc1cc(ccc1O)C1Nc2cccc3cccc(N1)c23