Reaction Details
TargetG-protein coupled receptor 55
LigandBDBM42045
Substrate/Competitorn/a
Meas. Tech.Image-based HTS for Selective Agonists of GPR55
EC50 32000±n/a nM
Citation PubChem, PC Image-based HTS for Selective Agonists of GPR55 PubChem Bioassay(2010)[AID]
 
G-protein coupled receptor 55
Name:G-protein coupled receptor 55
Type:PROTEIN
Mol. Mass.:36649.72
Organism:Homo sapiens (Human)
Description:ChEMBL_1292265
Residue:319
BDBM42045
NameBDBM42045
Synonyms:MLS000554273 S-[1-(1-ethanoylindol-3-yl)-2-nitro-ethyl] ethanethioate Thioacetic acid S-[1-(1-acetyl-1H-indol-3-yl)-2-nitro-ethyl] ester ethanethioic acid S-[1-(1-acetyl-3-indolyl)-2-nitroethyl] ester | ethanethioic acid S-[1-(1-acetylindol-3-yl)-2-nitro-ethyl] ester
TypeSmall organic molecule
Emp. Form.C14H14N2O4S
Mol. Mass.306.337
SMILESCC(=O)SC(C[N+]([O-])=O)c1cn(C(C)=O)c2ccccc12