Reaction Details
TargetG-protein coupled receptor 55
LigandBDBM61025
Substrate/Competitorn/a
Meas. Tech.Image-based HTS for Selective Agonists of GPR55
EC50 32000±n/a nM
Citation PubChem, PC Image-based HTS for Selective Agonists of GPR55 PubChem Bioassay(2010)[AID]
 
G-protein coupled receptor 55
Name:G-protein coupled receptor 55
Type:PROTEIN
Mol. Mass.:36649.72
Organism:Homo sapiens (Human)
Description:ChEMBL_1292265
Residue:319
BDBM61025
NameBDBM61025
Synonyms:3-(1,3-benzothiazol-2-ylsulfanylmethyl)-4-ethyl-1H-1,2,4-triazole-5-thione MLS000564731 cid_2363757
TypeSmall organic molecule
Emp. Form.C12H12N4S3
Mol. Mass.308.445
SMILESCCn1c(CSc2nc3ccccc3s2)n[nH]c1=S