Reaction Details
TargetG-protein coupled receptor 55
LigandBDBM61153
Substrate/Competitorn/a
Meas. Tech.Image-based HTS for Selective Agonists of GPR55
EC50 1453.088±n/a nM
Citation PubChem, PC Image-based HTS for Selective Agonists of GPR55 PubChem Bioassay(2010)[AID]
 
G-protein coupled receptor 55
Name:G-protein coupled receptor 55
Type:PROTEIN
Mol. Mass.:36649.72
Organism:Homo sapiens (Human)
Description:ChEMBL_1292265
Residue:319
BDBM61153
NameBDBM61153
Synonyms:3-[4-[(5Z)-4-keto-5-(4-methylbenzylidene)-2-thioxo-thiazolidin-3-yl]butanoylamino]benzoic acid 3-[4-[(5Z)-5-[(4-methylphenyl)methylidene]-4-oxo-2-sulfanylidene-1,3-thiazolidin-3-yl]butanoylamino]benzoic acid MLS001034563 cid_1346721
TypeSmall organic molecule
Emp. Form.C22H20N2O4S2
Mol. Mass.440.535
SMILESCc1ccc(\C=C2/SC(=S)N(CCCC(=O)Nc3cccc(c3)C(O)=O)C2=O)cc1