Reaction Details
TargetSUMO-activating enzyme subunit 1
LigandBDBM32030
Substrate/Competitorn/a
Meas. Tech.uHTS HTRF assay for identification of inhibitors of SUMOylation
IC50 2630±n/a nM
Citation PubChem, PC uHTS HTRF assay for identification of inhibitors of SUMOylation PubChem Bioassay(2010)[AID]
 
SUMO-activating enzyme subunit 1
Name:SUMO-activating enzyme subunit 1
Type:Enzyme Catalytic Domain
Mol. Mass.:38440.84
Organism:Homo sapiens (Human)
Description:gi_17390638
Residue:346
BDBM32030
NameBDBM32030
Synonyms:2-chloranyl-N-(3-cyano-1-prop-2-enyl-pyrrolo[3,2-b]quinoxalin-2-yl)benzamide 2-chloro-N-(3-cyano-1-prop-2-enylpyrrolo[3,2-b]quinoxalin-2-yl)benzamide N-(1-allyl-3-cyano-pyrrolo[3,2-b]quinoxalin-2-yl)-2-chloro-benzamide cid_658849
TypeSmall organic molecule
Emp. Form.C21H14ClN5O
Mol. Mass.387.822
SMILESClc1ccccc1C(=O)Nc1c(C#N)c2nc3ccccc3nc2n1CC=C