Reaction Details
TargetSUMO-activating enzyme subunit 1
LigandBDBM35371
Substrate/Competitorn/a
Meas. Tech.uHTS HTRF assay for identification of inhibitors of SUMOylation
IC50 5600±n/a nM
Citation PubChem, PC uHTS HTRF assay for identification of inhibitors of SUMOylation PubChem Bioassay(2010)[AID]
 
SUMO-activating enzyme subunit 1
Name:SUMO-activating enzyme subunit 1
Type:Enzyme Catalytic Domain
Mol. Mass.:38440.84
Organism:Homo sapiens (Human)
Description:gi_17390638
Residue:346
BDBM35371
NameBDBM35371
Synonyms:(7-chloro-5-pyrrolidino-benzofurazan-4-yl)amine 7-chloro-5-(1-pyrrolidinyl)-2,1,3-benzoxadiazol-4-amine MLS000042514 cid_667215
TypeSmall organic molecule
Emp. Form.C10H11ClN4O
Mol. Mass.238.674
SMILESNc1c(cc(Cl)c2nonc12)N1CCCC1