Reaction Details
TargetSUMO-activating enzyme subunit 1
LigandBDBM39949
Substrate/Competitorn/a
Meas. Tech.uHTS HTRF assay for identification of inhibitors of SUMOylation
IC50 3540±n/a nM
Citation PubChem, PC uHTS HTRF assay for identification of inhibitors of SUMOylation PubChem Bioassay(2010)[AID]
 
SUMO-activating enzyme subunit 1
Name:SUMO-activating enzyme subunit 1
Type:Enzyme Catalytic Domain
Mol. Mass.:38440.84
Organism:Homo sapiens (Human)
Description:gi_17390638
Residue:346
BDBM39949
NameBDBM39949
Synonyms:MLS000053822 N-(6-ethyl-1,3-benzothiazol-2-yl)-2-(morpholin-4-ylmethyl)-4-oxidanylidene-1H-quinazoline-7-carboxamide N-(6-ethyl-1,3-benzothiazol-2-yl)-4-keto-2-(morpholinomethyl)-1H-quinazoline-7-carboxamide cid_2542796
TypeSmall organic molecule
Emp. Form.C23H23N5O3S
Mol. Mass.449.525
SMILESCCc1ccc2nc(NC(=O)c3ccc4c(c3)nc(CN3CCOCC3)[nH]c4=O)sc2c1