Reaction Details
TargetSUMO-activating enzyme subunit 1
LigandBDBM61158
Substrate/Competitorn/a
Meas. Tech.uHTS HTRF assay for identification of inhibitors of SUMOylation
IC50 1980±n/a nM
Citation PubChem, PC uHTS HTRF assay for identification of inhibitors of SUMOylation PubChem Bioassay(2010)[AID]
 
SUMO-activating enzyme subunit 1
Name:SUMO-activating enzyme subunit 1
Type:Enzyme Catalytic Domain
Mol. Mass.:38440.84
Organism:Homo sapiens (Human)
Description:gi_17390638
Residue:346
BDBM61158
NameBDBM61158
Synonyms:1-(1-Phenylamino-but-3-enyl)-7-oxa-bicyclo[2.2.1]hepta-2,5-diene-2,3-dicarboxylic acid dimethyl ester MLS000527128 cid_9549553 dimethyl 4-(1-phenylazanylbut-3-enyl)-7-oxabicyclo[2.2.1]hepta-2,5-diene-2,3-dicarboxylate;hydrochloride
TypeSmall organic molecule
Emp. Form.C20H21NO5
Mol. Mass.355.3844
SMILES[H]C12OC(C=C1)(C(CC=C)Nc1ccccc1)C(C(=O)OC)=C2C(=O)OC