Reaction Details
TargetSUMO-activating enzyme subunit 1
LigandBDBM34697
Substrate/Competitorn/a
Meas. Tech.uHTS HTRF assay for identification of inhibitors of SUMOylation
IC50 8400±n/a nM
Citation PubChem, PC uHTS HTRF assay for identification of inhibitors of SUMOylation PubChem Bioassay(2010)[AID]
 
SUMO-activating enzyme subunit 1
Name:SUMO-activating enzyme subunit 1
Type:Enzyme Catalytic Domain
Mol. Mass.:38440.84
Organism:Homo sapiens (Human)
Description:gi_17390638
Residue:346
BDBM34697
NameBDBM34697
Synonyms:MLS000569396 N-(1-butan-2-yl-3-cyano-pyrrolo[3,2-b]quinoxalin-2-yl)benzamide N-(3-cyano-1-sec-butyl-pyrrolo[3,2-b]quinoxalin-2-yl)benzamide US9073941, 1004 | cid_4101144
TypeSmall organic molecule
Emp. Form.C22H19N5O
Mol. Mass.369.4192
SMILESCCC(C)n1c(NC(=O)c2ccccc2)c(C#N)c2nc3ccccc3nc12