Reaction Details
TargetSUMO-activating enzyme subunit 1
LigandBDBM61164
Substrate/Competitorn/a
Meas. Tech.uHTS HTRF assay for identification of inhibitors of SUMOylation
IC50 9030±n/a nM
Citation PubChem, PC uHTS HTRF assay for identification of inhibitors of SUMOylation PubChem Bioassay(2010)[AID]
 
SUMO-activating enzyme subunit 1
Name:SUMO-activating enzyme subunit 1
Type:Enzyme Catalytic Domain
Mol. Mass.:38440.84
Organism:Homo sapiens (Human)
Description:gi_17390638
Residue:346
BDBM61164
NameBDBM61164
Synonyms:MLS000565971 N'-[(Z)-(4-chloro-2-phenylimino-1,3-thiazol-5-ylidene)methyl]-2-(2-phenylphenoxy)acetohydrazide N'-[(Z)-(4-chloro-2-phenylimino-5-thiazolylidene)methyl]-2-(2-phenylphenoxy)acetohydrazide cid_5971886
TypeSmall organic molecule
Emp. Form.C24H19ClN4O2S
Mol. Mass.462.951
SMILESClc1nc(Nc2ccccc2)sc1C=NNC(=O)COc1ccccc1-c1ccccc1