Reaction Details
TargetSUMO-activating enzyme subunit 1
LigandBDBM34724
Substrate/Competitorn/a
Meas. Tech.uHTS HTRF assay for identification of inhibitors of SUMOylation
IC50 7010±n/a nM
Citation PubChem, PC uHTS HTRF assay for identification of inhibitors of SUMOylation PubChem Bioassay(2010)[AID]
 
SUMO-activating enzyme subunit 1
Name:SUMO-activating enzyme subunit 1
Type:Enzyme Catalytic Domain
Mol. Mass.:38440.84
Organism:Homo sapiens (Human)
Description:gi_17390638
Residue:346
BDBM34724
NameBDBM34724
Synonyms:3-[2-[2-[(4-methylphenyl)methylidene]hydrazinyl]-2-oxoethoxy]-10-pyrido[1,2-a]indolecarboxylic acid ethyl ester MLS000326532 cid_1484858 ethyl 3-[2-[2-[(4-methylphenyl)methylidene]hydrazinyl]-2-oxidanylidene-ethoxy]pyrido[1,2-a]indole-10-carboxylate | ethyl 3-[2-[2-[(4-methylphenyl)methylidene]hydrazinyl]-2-oxoethoxy]pyrido[1,2-a]indole-10-carboxylate
TypeSmall organic molecule
Emp. Form.C25H23N3O4
Mol. Mass.429.4678
SMILESCCOC(=O)c1c2ccc(OCC(=O)NN=Cc3ccc(C)cc3)cc2n2ccccc12