Reaction Details
TargetSUMO-activating enzyme subunit 1
LigandBDBM41948
Substrate/Competitorn/a
Meas. Tech.uHTS HTRF assay for identification of inhibitors of SUMOylation
IC50 4640±n/a nM
Citation PubChem, PC uHTS HTRF assay for identification of inhibitors of SUMOylation PubChem Bioassay(2010)[AID]
 
SUMO-activating enzyme subunit 1
Name:SUMO-activating enzyme subunit 1
Type:Enzyme Catalytic Domain
Mol. Mass.:38440.84
Organism:Homo sapiens (Human)
Description:gi_17390638
Residue:346
BDBM41948
NameBDBM41948
Synonyms:5-(2,5-dichlorophenyl)-N-(5-methyl-2,1,3-benzothiadiazol-4-yl)-2-furamide 5-(2,5-dichlorophenyl)-N-(5-methyl-2,1,3-benzothiadiazol-4-yl)furan-2-carboxamide 5-[2,5-bis(chloranyl)phenyl]-N-(5-methyl-2,1,3-benzothiadiazol-4-yl)furan-2-carboxamide SMR000194480 | cid_1334850
TypeSmall organic molecule
Emp. Form.C18H11Cl2N3O2S
Mol. Mass.404.27
SMILESCc1ccc2nsnc2c1NC(=O)c1ccc(o1)-c1cc(Cl)ccc1Cl