Reaction Details
TargetSUMO-activating enzyme subunit 1
LigandBDBM61167
Substrate/Competitorn/a
Meas. Tech.uHTS HTRF assay for identification of inhibitors of SUMOylation
IC50 4070±n/a nM
Citation PubChem, PC uHTS HTRF assay for identification of inhibitors of SUMOylation PubChem Bioassay(2010)[AID]
 
SUMO-activating enzyme subunit 1
Name:SUMO-activating enzyme subunit 1
Type:Enzyme Catalytic Domain
Mol. Mass.:38440.84
Organism:Homo sapiens (Human)
Description:gi_17390638
Residue:346
BDBM61167
NameBDBM61167
Synonyms:2-(1,3-benzoxazol-2-ylamino)-6-methyl-4-(4-methylphenyl)-N-phenyl-1,4-dihydro-5-pyrimidinecarboxamide 2-(1,3-benzoxazol-2-ylamino)-6-methyl-N-phenyl-4-(p-tolyl)-1,4-dihydropyrimidine-5-carboxamide SMR000200836 | cid_2967155
TypeSmall organic molecule
Emp. Form.C26H23N5O2
Mol. Mass.437.4931
SMILESCC1=NC(Nc2nc3ccccc3o2)=NC(C1C(=O)Nc1ccccc1)c1ccc(C)cc1