Reaction Details
TargetSUMO-activating enzyme subunit 1
LigandBDBM50986
Substrate/Competitorn/a
Meas. Tech.uHTS HTRF assay for identification of inhibitors of SUMOylation
IC50 8680±n/a nM
Citation PubChem, PC uHTS HTRF assay for identification of inhibitors of SUMOylation PubChem Bioassay(2010)[AID]
 
SUMO-activating enzyme subunit 1
Name:SUMO-activating enzyme subunit 1
Type:Enzyme Catalytic Domain
Mol. Mass.:38440.84
Organism:Homo sapiens (Human)
Description:gi_17390638
Residue:346
BDBM50986
NameBDBM50986
Synonyms:MLS000563434 cid_160876
TypeSmall organic molecule
Emp. Form.C20H18NO4
Mol. Mass.336.3607
SMILESCOc1cc2CC[n+]3cc4c5OCOc5ccc4cc3-c2cc1OC