Reaction Details
TargetSUMO-activating enzyme subunit 1
LigandBDBM50995
Substrate/Competitorn/a
Meas. Tech.uHTS HTRF assay for identification of inhibitors of SUMOylation
IC50 8490±n/a nM
Citation PubChem, PC uHTS HTRF assay for identification of inhibitors of SUMOylation PubChem Bioassay(2010)[AID]
 
SUMO-activating enzyme subunit 1
Name:SUMO-activating enzyme subunit 1
Type:Enzyme Catalytic Domain
Mol. Mass.:38440.84
Organism:Homo sapiens (Human)
Description:gi_17390638
Residue:346
BDBM50995
NameBDBM50995
Synonyms:2-{4-[(4-Hydroxy-benzoyl)-hydrazonomethyl]-phenoxy}-N-(4-nitro-phenyl)-acetamide 4-hydroxy-N-[[4-[2-keto-2-(4-nitroanilino)ethoxy]benzylidene]amino]benzamide N-[[4-[2-[(4-nitrophenyl)amino]-2-oxidanylidene-ethoxy]phenyl]methylideneamino]-4-oxidanyl-benzamide cid_3115893
TypeSmall organic molecule
Emp. Form.C22H18N4O6
Mol. Mass.434.4015
SMILESOc1ccc(cc1)C(=O)NN=Cc1ccc(OCC(=O)Nc2ccc(cc2)[N+]([O-])=O)cc1