Reaction Details
TargetSUMO-activating enzyme subunit 1
LigandBDBM48726
Substrate/Competitorn/a
Meas. Tech.uHTS HTRF assay for identification of inhibitors of SUMOylation
IC50 7670±n/a nM
Citation PubChem, PC uHTS HTRF assay for identification of inhibitors of SUMOylation PubChem Bioassay(2010)[AID]
 
SUMO-activating enzyme subunit 1
Name:SUMO-activating enzyme subunit 1
Type:Enzyme Catalytic Domain
Mol. Mass.:38440.84
Organism:Homo sapiens (Human)
Description:gi_17390638
Residue:346
BDBM48726
NameBDBM48726
Synonyms:4-(7,8-Dimethoxy-1-methyl-3-phenyl-3H-pyrazolo[3,4-c]isoquinolin-5-yl)-phenol 4-(7,8-dimethoxy-1-methyl-3-phenyl-2H-pyrazolo[3,4-c]isoquinolin-5-ylidene)-1-cyclohexa-2,5-dienone MLS000553551 cid_5429530
TypeSmall organic molecule
Emp. Form.C25H21N3O3
Mol. Mass.411.4525
SMILESCOc1cc2c(nc3n(nc(C)c3c2cc1OC)-c1ccccc1)-c1ccc(O)cc1