Reaction Details
TargetSUMO-activating enzyme subunit 1
LigandBDBM54915
Substrate/Competitorn/a
Meas. Tech.uHTS HTRF assay for identification of inhibitors of SUMOylation
IC50 1830±n/a nM
Citation PubChem, PC uHTS HTRF assay for identification of inhibitors of SUMOylation PubChem Bioassay(2010)[AID]
 
SUMO-activating enzyme subunit 1
Name:SUMO-activating enzyme subunit 1
Type:Enzyme Catalytic Domain
Mol. Mass.:38440.84
Organism:Homo sapiens (Human)
Description:gi_17390638
Residue:346
BDBM54915
NameBDBM54915
Synonyms:MLS000588658 N-[1-Butyl-3-(toluene-4-sulfonyl)-1H-pyrrolo[2,3-b]quinoxalin-2-yl]-benzenesulfonamide N-[1-butyl-3-(4-methylphenyl)sulfonyl-pyrrolo[3,2-b]quinoxalin-2-yl]benzenesulfonamide SMR000212297 cid_1930124
TypeSmall organic molecule
Emp. Form.C27H26N4O4S2
Mol. Mass.534.65
SMILESCCCCn1c(NS(=O)(=O)c2ccccc2)c(c2nc3ccccc3nc12)S(=O)(=O)c1ccc(C)cc1