Reaction Details
TargetSUMO-activating enzyme subunit 1
LigandBDBM43091
Substrate/Competitorn/a
Meas. Tech.uHTS HTRF assay for identification of inhibitors of SUMOylation
IC50 4970±n/a nM
Citation PubChem, PC uHTS HTRF assay for identification of inhibitors of SUMOylation PubChem Bioassay(2010)[AID]
 
SUMO-activating enzyme subunit 1
Name:SUMO-activating enzyme subunit 1
Type:Enzyme Catalytic Domain
Mol. Mass.:38440.84
Organism:Homo sapiens (Human)
Description:gi_17390638
Residue:346
BDBM43091
NameBDBM43091
Synonyms:2-[2-(3-chlorobenzothiophene-2-carbonyl)imino-6-sulfamoyl-1,3-benzothiazol-3-yl]acetic acid ethyl ester MLS000697082 cid_4625720 ethyl 2-[2-[(3-chloranyl-1-benzothiophen-2-yl)carbonylimino]-6-sulfamoyl-1,3-benzothiazol-3-yl]ethanoate
TypeSmall organic molecule
Emp. Form.C20H16ClN3O5S3
Mol. Mass.510.006
SMILESCCOC(=O)Cn1c2ccc(cc2s\c1=N/C(=O)c1sc2ccccc2c1Cl)S(N)(=O)=O