Reaction Details
TargetSUMO-activating enzyme subunit 1
LigandBDBM47597
Substrate/Competitorn/a
Meas. Tech.uHTS HTRF assay for identification of inhibitors of SUMOylation
IC50 2960±n/a nM
Citation PubChem, PC uHTS HTRF assay for identification of inhibitors of SUMOylation PubChem Bioassay(2010)[AID]
 
SUMO-activating enzyme subunit 1
Name:SUMO-activating enzyme subunit 1
Type:Enzyme Catalytic Domain
Mol. Mass.:38440.84
Organism:Homo sapiens (Human)
Description:gi_17390638
Residue:346
BDBM47597
NameBDBM47597
Synonyms:MLS000591719 N-(12-cyano-3-indolizino[2,3-b]quinoxalinyl)-4-fluorobenzamide N-(12-cyanoindolizino[2,3-b]quinoxalin-3-yl)-4-fluoro-benzamide SMR000218727 | cid_1867702
TypeSmall organic molecule
Emp. Form.C22H12FN5O
Mol. Mass.381.362
SMILESFc1ccc(cc1)C(=O)Nc1ccc2c(C#N)c3nc4ccccc4nc3n2c1