Reaction Details
TargetSUMO-activating enzyme subunit 1
LigandBDBM50388
Substrate/Competitorn/a
Meas. Tech.uHTS HTRF assay for identification of inhibitors of SUMOylation
IC50 8520±n/a nM
Citation PubChem, PC uHTS HTRF assay for identification of inhibitors of SUMOylation PubChem Bioassay(2010)[AID]
 
SUMO-activating enzyme subunit 1
Name:SUMO-activating enzyme subunit 1
Type:Enzyme Catalytic Domain
Mol. Mass.:38440.84
Organism:Homo sapiens (Human)
Description:gi_17390638
Residue:346
BDBM50388
NameBDBM50388
Synonyms:(E)-2-cyano-3-[5-(4-nitrophenyl)-2-furanyl]-N-(4-thiophen-2-yl-2-thiazolyl)-2-propenamide (E)-2-cyano-3-[5-(4-nitrophenyl)furan-2-yl]-N-(4-thiophen-2-yl-1,3-thiazol-2-yl)prop-2-enamide SMR000262227 | cid_2328884
TypeSmall organic molecule
Emp. Form.C21H12N4O4S2
Mol. Mass.448.474
SMILES[O-][N+](=O)c1ccc(cc1)-c1ccc(\C=C(/C#N)C(=O)Nc2nc(cs2)-c2cccs2)o1