Reaction Details
TargetSUMO-activating enzyme subunit 1
LigandBDBM61189
Substrate/Competitorn/a
Meas. Tech.uHTS HTRF assay for identification of inhibitors of SUMOylation
IC50 6770±n/a nM
Citation PubChem, PC uHTS HTRF assay for identification of inhibitors of SUMOylation PubChem Bioassay(2010)[AID]
 
SUMO-activating enzyme subunit 1
Name:SUMO-activating enzyme subunit 1
Type:Enzyme Catalytic Domain
Mol. Mass.:38440.84
Organism:Homo sapiens (Human)
Description:gi_17390638
Residue:346
BDBM61189
NameBDBM61189
Synonyms:5-(3-Chloro-phenyl)-furan-2-carboxylic acid (2-oxo-2H-chromen-6-yl)-amide 5-(3-chlorophenyl)-N-(2-oxidanylidenechromen-6-yl)furan-2-carboxamide 5-(3-chlorophenyl)-N-(2-oxochromen-6-yl)furan-2-carboxamide SMR000220853 | cid_1844438
TypeSmall organic molecule
Emp. Form.C20H12ClNO4
Mol. Mass.365.767
SMILESClc1cccc(c1)-c1ccc(o1)C(=O)Nc1ccc2oc(=O)ccc2c1