Reaction Details
TargetSUMO-activating enzyme subunit 1
LigandBDBM54979
Substrate/Competitorn/a
Meas. Tech.uHTS HTRF assay for identification of inhibitors of SUMOylation
IC50 7430±n/a nM
Citation PubChem, PC uHTS HTRF assay for identification of inhibitors of SUMOylation PubChem Bioassay(2010)[AID]
 
SUMO-activating enzyme subunit 1
Name:SUMO-activating enzyme subunit 1
Type:Enzyme Catalytic Domain
Mol. Mass.:38440.84
Organism:Homo sapiens (Human)
Description:gi_17390638
Residue:346
BDBM54979
NameBDBM54979
Synonyms:2-[[2-[4-[(2-cyanoacetyl)amino]benzoyl]oxyacetyl]amino]-5,6,7,8-tetrahydro-4H-cyclohepta[b]thiophene-3-carboxylic acid methyl ester MLS000335296 cid_3621945 methyl 2-[[2-[4-[(2-cyanoacetyl)amino]benzoyl]oxyacetyl]amino]-5,6,7,8-tetrahydro-4H-cyclohepta[b]thiophene-3-carboxylate
TypeSmall organic molecule
Emp. Form.C23H23N3O6S
Mol. Mass.469.51
SMILESCOC(=O)c1c(NC(=O)COC(=O)c2ccc(NC(=O)CC#N)cc2)sc2CCCCCc12