Reaction Details
TargetSUMO-activating enzyme subunit 1
LigandBDBM44110
Substrate/Competitorn/a
Meas. Tech.uHTS HTRF assay for identification of inhibitors of SUMOylation
IC50 4540±n/a nM
Citation PubChem, PC uHTS HTRF assay for identification of inhibitors of SUMOylation PubChem Bioassay(2010)[AID]
 
SUMO-activating enzyme subunit 1
Name:SUMO-activating enzyme subunit 1
Type:Enzyme Catalytic Domain
Mol. Mass.:38440.84
Organism:Homo sapiens (Human)
Description:gi_17390638
Residue:346
BDBM44110
NameBDBM44110
Synonyms:(5Z)-3-[[(E)-(6-keto-3-nitro-cyclohexa-2,4-dien-1-ylidene)methyl]amino]-5-[(5-methyl-2-furyl)methylene]-2-thioxo-thiazolidin-4-one (5Z)-5-[(5-methylfuran-2-yl)methylidene]-3-[[(E)-(3-nitro-6-oxidanylidene-cyclohexa-2,4-dien-1-ylidene)methyl]amino]-2-sulfanylidene-1,3-thiazolidin-4-one 3-[(2-hydroxy-5-nitrobenzylidene)amino]-5-[(5-methyl-2-furyl)methylene]-2-thioxo-1,3-thiazolidin-4-one SMR000297974 | cid_5891295
TypeSmall organic molecule
Emp. Form.C16H11N3O5S2
Mol. Mass.389.406
SMILESCc1ccc(\C=C2/SC(=S)N(\[NH+]=C\[c-]3cc(ccc3=O)[N+]([O-])=O)C2=O)o1