Reaction Details
TargetSUMO-activating enzyme subunit 1
LigandBDBM61195
Substrate/Competitorn/a
Meas. Tech.uHTS HTRF assay for identification of inhibitors of SUMOylation
IC50 5630±n/a nM
Citation PubChem, PC uHTS HTRF assay for identification of inhibitors of SUMOylation PubChem Bioassay(2010)[AID]
 
SUMO-activating enzyme subunit 1
Name:SUMO-activating enzyme subunit 1
Type:Enzyme Catalytic Domain
Mol. Mass.:38440.84
Organism:Homo sapiens (Human)
Description:gi_17390638
Residue:346
BDBM61195
NameBDBM61195
Synonyms:MLS000765857 N'-(2,6-dipyrrolidin-1-ylpyrimidin-4-yl)-4-nitrobenzohydrazide N'-[2,6-bis(1-pyrrolidinyl)-4-pyrimidinyl]-4-nitrobenzohydrazide cid_3121369
TypeSmall organic molecule
Emp. Form.C19H23N7O3
Mol. Mass.397.431
SMILES[O-][N+](=O)c1ccc(cc1)C(=O)NNc1cc(nc(n1)N1CCCC1)N1CCCC1