Reaction Details
TargetSUMO-activating enzyme subunit 1
LigandBDBM61197
Substrate/Competitorn/a
Meas. Tech.uHTS HTRF assay for identification of inhibitors of SUMOylation
IC50 2310±n/a nM
Citation PubChem, PC uHTS HTRF assay for identification of inhibitors of SUMOylation PubChem Bioassay(2010)[AID]
 
SUMO-activating enzyme subunit 1
Name:SUMO-activating enzyme subunit 1
Type:Enzyme Catalytic Domain
Mol. Mass.:38440.84
Organism:Homo sapiens (Human)
Description:gi_17390638
Residue:346
BDBM61197
NameBDBM61197
Synonyms:(2,6-dipyrrolidinopyrimidin-4-yl)-(p-anisylideneamino)amine MLS000720213 N-[(4-methoxyphenyl)methylideneamino]-2,6-dipyrrolidin-1-yl-pyrimidin-4-amine SMR000304742 | cid_2851352
TypeSmall organic molecule
Emp. Form.C20H26N6O
Mol. Mass.366.46
SMILESCOc1ccc(CN=Nc2cc(nc(n2)N2CCCC2)N2CCCC2)cc1