Reaction Details
TargetSUMO-activating enzyme subunit 1
LigandBDBM52709
Substrate/Competitorn/a
Meas. Tech.uHTS HTRF assay for identification of inhibitors of SUMOylation
IC50 8760±n/a nM
Citation PubChem, PC uHTS HTRF assay for identification of inhibitors of SUMOylation PubChem Bioassay(2010)[AID]
 
SUMO-activating enzyme subunit 1
Name:SUMO-activating enzyme subunit 1
Type:Enzyme Catalytic Domain
Mol. Mass.:38440.84
Organism:Homo sapiens (Human)
Description:gi_17390638
Residue:346
BDBM52709
NameBDBM52709
Synonyms:2-cyano-N'-[(1E)-(2-hydroxy-3-methoxy-5-nitrophenyl)methylene]acetohydrazide 2-cyano-N'-[(E)-(5-methoxy-3-nitro-6-oxo-1-cyclohexa-2,4-dienylidene)methyl]acetohydrazide 2-cyano-N'-[(E)-(6-keto-5-methoxy-3-nitro-cyclohexa-2,4-dien-1-ylidene)methyl]acetohydrazide SMR000312605 | cid_5884095
TypeSmall organic molecule
Emp. Form.C11H10N4O5
Mol. Mass.278.2209
SMILESCOc1cc(c[c-](\C=[NH+]\NC(=O)CC#N)c1=O)[N+]([O-])=O