Reaction Details
TargetSUMO-activating enzyme subunit 1
LigandBDBM34943
Substrate/Competitorn/a
Meas. Tech.uHTS HTRF assay for identification of inhibitors of SUMOylation
IC50 1640±n/a nM
Citation PubChem, PC uHTS HTRF assay for identification of inhibitors of SUMOylation PubChem Bioassay(2010)[AID]
 
SUMO-activating enzyme subunit 1
Name:SUMO-activating enzyme subunit 1
Type:Enzyme Catalytic Domain
Mol. Mass.:38440.84
Organism:Homo sapiens (Human)
Description:gi_17390638
Residue:346
BDBM34943
NameBDBM34943
Synonyms:3-(2-hydrazino-2-keto-ethoxy)pyrid[1,2-a]indole-10-carboxylic acid ethyl ester MLS000764221 cid_1484849 ethyl 3-(2-hydrazino-2-oxoethoxy)pyrido[1,2-a]indole-10-carboxylate | ethyl 3-(2-hydrazinyl-2-oxoethoxy)pyrido[1,2-a]indole-10-carboxylate
TypeSmall organic molecule
Emp. Form.C17H17N3O4
Mol. Mass.327.3346
SMILESCCOC(=O)c1c2ccc(OCC(=O)NN)cc2n2ccccc12