Reaction Details
TargetSUMO-activating enzyme subunit 1
LigandBDBM61207
Substrate/Competitorn/a
Meas. Tech.uHTS HTRF assay for identification of inhibitors of SUMOylation
IC50 8770±n/a nM
Citation PubChem, PC uHTS HTRF assay for identification of inhibitors of SUMOylation PubChem Bioassay(2010)[AID]
 
SUMO-activating enzyme subunit 1
Name:SUMO-activating enzyme subunit 1
Type:Enzyme Catalytic Domain
Mol. Mass.:38440.84
Organism:Homo sapiens (Human)
Description:gi_17390638
Residue:346
BDBM61207
NameBDBM61207
Synonyms:3-[[(E)-(3-methyl-5-nitro-6-oxidanylidene-cyclohexa-2,4-dien-1-ylidene)methyl]amino]-2-[(1-phenylethylideneamino)oxymethyl]quinazolin-4-one 3-[[(E)-(3-methyl-5-nitro-6-oxocyclohexa-2,4-dien-1-ylidene)methyl]amino]-2-[(1-phenylethylideneamino)oxymethyl]quinazolin-4-one 3-[[(E)-(6-keto-3-methyl-5-nitro-cyclohexa-2,4-dien-1-ylidene)methyl]amino]-2-[[(E)-1-phenylethylideneamino]oxymethyl]quinazolin-4-one MLS000777971 cid_16681762
TypeSmall organic molecule
Emp. Form.C25H21N5O5
Mol. Mass.471.4647
SMILESC[C+]([N-]OCc1nc2ccccc2c(=O)n1\[NH+]=C\[c-]1cc(C)cc([N+]([O-])=O)c1=O)c1ccccc1