Reaction Details
TargetSUMO-activating enzyme subunit 1
LigandBDBM61211
Substrate/Competitorn/a
Meas. Tech.uHTS HTRF assay for identification of inhibitors of SUMOylation
IC50 7540±n/a nM
Citation PubChem, PC uHTS HTRF assay for identification of inhibitors of SUMOylation PubChem Bioassay(2010)[AID]
 
SUMO-activating enzyme subunit 1
Name:SUMO-activating enzyme subunit 1
Type:Enzyme Catalytic Domain
Mol. Mass.:38440.84
Organism:Homo sapiens (Human)
Description:gi_17390638
Residue:346
BDBM61211
NameBDBM61211
Synonyms:(6E)-5-azanylidene-6-[[2,5-dimethyl-1-(phenylmethyl)pyrrol-3-yl]methylidene]-2-(furan-2-yl)-[1,3,4]thiadiazolo[3,2-a]pyrimidin-7-one (6E)-6-[(1-benzyl-2,5-dimethylpyrrol-3-yl)methylidene]-2-(furan-2-yl)-5-imino-[1,3,4]thiadiazolo[3,2-a]pyrimidin-7-one 6-[1-(1-Benzyl-2,5-dimethyl-1H-pyrrol-3-yl)-meth-(E)-ylidene]-2-furan-2-yl-5-imino-5,6-dihydro-[1,3,4]thia diazolo[3,2-a]pyrimidin-7-one SMR000438147 | cid_16422746
TypeSmall organic molecule
Emp. Form.C23H19N5O2S
Mol. Mass.429.494
SMILESCc1cc(\C=C2\C(=O)N=C3SC(=NN3C2=N)c2ccco2)c(C)n1Cc1ccccc1