Reaction Details
TargetSUMO-activating enzyme subunit 1
LigandBDBM61212
Substrate/Competitorn/a
Meas. Tech.uHTS HTRF assay for identification of inhibitors of SUMOylation
IC50 7820±n/a nM
Citation PubChem, PC uHTS HTRF assay for identification of inhibitors of SUMOylation PubChem Bioassay(2010)[AID]
 
SUMO-activating enzyme subunit 1
Name:SUMO-activating enzyme subunit 1
Type:Enzyme Catalytic Domain
Mol. Mass.:38440.84
Organism:Homo sapiens (Human)
Description:gi_17390638
Residue:346
BDBM61212
NameBDBM61212
Synonyms:MLS001042192 N-(1-heptyl-2-benzimidazolyl)propanamide N-(1-heptylbenzimidazol-2-yl)propionamide cid_3844957
TypeSmall organic molecule
Emp. Form.C17H25N3O
Mol. Mass.287.3999
SMILESCCCCCCCn1c(NC(=O)CC)nc2ccccc12