Reaction Details
TargetSUMO-activating enzyme subunit 1
LigandBDBM52840
Substrate/Competitorn/a
Meas. Tech.uHTS HTRF assay for identification of inhibitors of SUMOylation
IC50 8600±n/a nM
Citation PubChem, PC uHTS HTRF assay for identification of inhibitors of SUMOylation PubChem Bioassay(2010)[AID]
 
SUMO-activating enzyme subunit 1
Name:SUMO-activating enzyme subunit 1
Type:Enzyme Catalytic Domain
Mol. Mass.:38440.84
Organism:Homo sapiens (Human)
Description:gi_17390638
Residue:346
BDBM52840
NameBDBM52840
Synonyms:(8-amino-2-naphthalenyl)arsonic acid (8-aminonaphthalen-2-yl)arsonic acid MLS000737386 cid_224275
TypeSmall organic molecule
Emp. Form.C10H10AsNO3
Mol. Mass.267.1129
SMILESNc1cccc2ccc(cc12)[As](O)(O)=O