Reaction Details
TargetSUMO-activating enzyme subunit 1
LigandBDBM46589
Substrate/Competitorn/a
Meas. Tech.uHTS HTRF assay for identification of inhibitors of SUMOylation
IC50 3920±n/a nM
Citation PubChem, PC uHTS HTRF assay for identification of inhibitors of SUMOylation PubChem Bioassay(2010)[AID]
 
SUMO-activating enzyme subunit 1
Name:SUMO-activating enzyme subunit 1
Type:Enzyme Catalytic Domain
Mol. Mass.:38440.84
Organism:Homo sapiens (Human)
Description:gi_17390638
Residue:346
BDBM46589
NameBDBM46589
Synonyms:2-[(1,8-diamino-5-cyano-6-piperidin-1-yl-2,7-naphthyridin-3-yl)sulfanyl]acetic acid 2-[[1,8-bis(azanyl)-5-cyano-6-piperidin-1-yl-2,7-naphthyridin-3-yl]sulfanyl]ethanoic acid MLS000773334 cid_3327739
TypeSmall organic molecule
Emp. Form.C16H18N6O2S
Mol. Mass.358.418
SMILESNc1nc(SCC(O)=O)cc2c(C#N)c(nc(N)c12)N1CCCCC1