Reaction Details
TargetSUMO-activating enzyme subunit 1
LigandBDBM50743
Substrate/Competitorn/a
Meas. Tech.uHTS HTRF assay for identification of inhibitors of SUMOylation
IC50 5900±n/a nM
Citation PubChem, PC uHTS HTRF assay for identification of inhibitors of SUMOylation PubChem Bioassay(2010)[AID]
 
SUMO-activating enzyme subunit 1
Name:SUMO-activating enzyme subunit 1
Type:Enzyme Catalytic Domain
Mol. Mass.:38440.84
Organism:Homo sapiens (Human)
Description:gi_17390638
Residue:346
BDBM50743
NameBDBM50743
Synonyms:4-[(5E)-4-keto-5-p-anisylidene-2-thioxo-thiazolidin-3-yl]-N-thiazol-2-yl-benzenesulfonamide 4-[(5E)-5-[(4-methoxyphenyl)methylidene]-4-oxo-2-sulfanylidene-1,3-thiazolidin-3-yl]-N-(1,3-thiazol-2-yl)benzenesulfonamide 4-{5-[(4-methoxyphenyl)methylene]-4-oxo-2-thioxo-1,3-thiazolan-3-yl}-N-(1,3-thiazol-2-yl)benzenesulfonamide SMR000456799 | cid_6364952
TypeSmall organic molecule
Emp. Form.C20H15N3O4S4
Mol. Mass.489.611
SMILESCOc1ccc(\C=C2\SC(=S)N(C2=O)c2ccc(cc2)S(=O)(=O)Nc2nccs2)cc1