Reaction Details
TargetSUMO-activating enzyme subunit 1
LigandBDBM61236
Substrate/Competitorn/a
Meas. Tech.uHTS HTRF assay for identification of inhibitors of SUMOylation
IC50 8710±n/a nM
Citation PubChem, PC uHTS HTRF assay for identification of inhibitors of SUMOylation PubChem Bioassay(2010)[AID]
 
SUMO-activating enzyme subunit 1
Name:SUMO-activating enzyme subunit 1
Type:Enzyme Catalytic Domain
Mol. Mass.:38440.84
Organism:Homo sapiens (Human)
Description:gi_17390638
Residue:346
BDBM61236
NameBDBM61236
Synonyms:2-{4-[(2-Hydroxy-benzoyl)-hydrazonomethyl]-2-methoxy-phenoxy}-N-phenyl-acetamide N-[[3-methoxy-4-(2-oxidanylidene-2-phenylazanyl-ethoxy)phenyl]methylideneamino]-2-oxidanyl-benzamide N-[[4-(2-anilino-2-oxoethoxy)-3-methoxyphenyl]methylideneamino]-2-hydroxybenzamide cid_1105530
TypeSmall organic molecule
Emp. Form.C23H21N3O5
Mol. Mass.419.4299
SMILESCOc1cc(C=NNC(=O)c2ccccc2O)ccc1OCC(=O)Nc1ccccc1