Reaction Details
TargetSUMO-activating enzyme subunit 1
LigandBDBM53174
Substrate/Competitorn/a
Meas. Tech.uHTS HTRF assay for identification of inhibitors of SUMOylation
IC50 6470±n/a nM
Citation PubChem, PC uHTS HTRF assay for identification of inhibitors of SUMOylation PubChem Bioassay(2010)[AID]
 
SUMO-activating enzyme subunit 1
Name:SUMO-activating enzyme subunit 1
Type:Enzyme Catalytic Domain
Mol. Mass.:38440.84
Organism:Homo sapiens (Human)
Description:gi_17390638
Residue:346
BDBM53174
NameBDBM53174
Synonyms:3,6-bis(2-furanyl)-1,2,4,5-tetrazine 3,6-bis(furan-2-yl)-1,2,4,5-tetrazine SMR000589637 | cid_2554659
TypeSmall organic molecule
Emp. Form.C10H6N4O2
Mol. Mass.214.1802
SMILESc1coc(c1)-c1nnc(nn1)-c1ccco1