Reaction Details
TargetSUMO-activating enzyme subunit 1
LigandBDBM53205
Substrate/Competitorn/a
Meas. Tech.uHTS HTRF assay for identification of inhibitors of SUMOylation
IC50 2110±n/a nM
Citation PubChem, PC uHTS HTRF assay for identification of inhibitors of SUMOylation PubChem Bioassay(2010)[AID]
 
SUMO-activating enzyme subunit 1
Name:SUMO-activating enzyme subunit 1
Type:Enzyme Catalytic Domain
Mol. Mass.:38440.84
Organism:Homo sapiens (Human)
Description:gi_17390638
Residue:346
BDBM53205
NameBDBM53205
Synonyms:1,3-bis[[(Z)-(3-hydroxy-4-keto-cyclohexa-2,5-dien-1-ylidene)methyl]amino]urea 1,3-bis[[(Z)-(3-hydroxy-4-oxocyclohexa-2,5-dien-1-ylidene)methyl]amino]urea MLS001202140 SMR000565039 | cid_24762014
TypeSmall organic molecule
Emp. Form.C15H14N4O5
Mol. Mass.330.2955
SMILESO=C(NN=CC1=CC(=O)C(=O)CC1)NN=CC1=CC(=O)C(=O)CC1