Reaction Details
TargetSUMO-activating enzyme subunit 1
LigandBDBM61244
Substrate/Competitorn/a
Meas. Tech.uHTS HTRF assay for identification of inhibitors of SUMOylation
IC50 9170±n/a nM
Citation PubChem, PC uHTS HTRF assay for identification of inhibitors of SUMOylation PubChem Bioassay(2010)[AID]
 
SUMO-activating enzyme subunit 1
Name:SUMO-activating enzyme subunit 1
Type:Enzyme Catalytic Domain
Mol. Mass.:38440.84
Organism:Homo sapiens (Human)
Description:gi_17390638
Residue:346
BDBM61244
NameBDBM61244
Synonyms:MLS001175206 N-[5-(diethylsulfamoyl)-2-hydroxyphenyl]-2-(3,4,5-trimethoxyphenyl)-4-quinolinecarboxamide N-[5-(diethylsulfamoyl)-2-oxidanyl-phenyl]-2-(3,4,5-trimethoxyphenyl)quinoline-4-carboxamide cid_4321047
TypeSmall organic molecule
Emp. Form.C29H31N3O7S
Mol. Mass.565.637
SMILESCCN(CC)S(=O)(=O)c1ccc(O)c(NC(=O)c2cc(nc3ccccc23)-c2cc(OC)c(OC)c(OC)c2)c1