Reaction Details
TargetSUMO-activating enzyme subunit 1
LigandBDBM61247
Substrate/Competitorn/a
Meas. Tech.uHTS HTRF assay for identification of inhibitors of SUMOylation
IC50 4470±n/a nM
Citation PubChem, PC uHTS HTRF assay for identification of inhibitors of SUMOylation PubChem Bioassay(2010)[AID]
 
SUMO-activating enzyme subunit 1
Name:SUMO-activating enzyme subunit 1
Type:Enzyme Catalytic Domain
Mol. Mass.:38440.84
Organism:Homo sapiens (Human)
Description:gi_17390638
Residue:346
BDBM61247
NameBDBM61247
Synonyms:2-azanylidene-3-(4-chlorophenyl)sulfonyl-1-(furan-2-ylmethyl)dipyrido[1,2-d:3',4'-f]pyrimidin-5-one 3-(4-chlorophenyl)sulfonyl-1-(2-furfuryl)-2-imino-dipyrido[1,2-d:3',4'-f]pyrimidin-5-one MLS000948072 cid_3705648
TypeSmall organic molecule
Emp. Form.C22H15ClN4O4S
Mol. Mass.466.897
SMILESClc1ccc(cc1)S(=O)(=O)c1cc2c(nc3ccccn3c2=O)n(Cc2ccco2)c1=N