Reaction Details
TargetSUMO-activating enzyme subunit 1
LigandBDBM61250
Substrate/Competitorn/a
Meas. Tech.uHTS HTRF assay for identification of inhibitors of SUMOylation
IC50 4160±n/a nM
Citation PubChem, PC uHTS HTRF assay for identification of inhibitors of SUMOylation PubChem Bioassay(2010)[AID]
 
SUMO-activating enzyme subunit 1
Name:SUMO-activating enzyme subunit 1
Type:Enzyme Catalytic Domain
Mol. Mass.:38440.84
Organism:Homo sapiens (Human)
Description:gi_17390638
Residue:346
BDBM61250
NameBDBM61250
Synonyms:2-azanylidene-3-(4-bromophenyl)sulfonyl-1-(furan-2-ylmethyl)dipyrido[1,2-d:3',4'-f]pyrimidin-5-one 3-(4-bromophenyl)sulfonyl-1-(furan-2-ylmethyl)-2-iminodipyrido[1,2-d:3',4'-f]pyrimidin-5-one MLS001146179 cid_3321332
TypeSmall organic molecule
Emp. Form.C22H15BrN4O4S
Mol. Mass.511.348
SMILESBrc1ccc(cc1)S(=O)(=O)c1cc2c(nc3ccccn3c2=O)n(Cc2ccco2)c1=N